Documentation for (&&) and (&&) states that they are lazy in their second argument (fixes #17354)

31 jobs for master in 506 minutes and 27 seconds (queued for 3 seconds)
Status Job ID Name Coverage
  Lint
passed #184515
lint
lint-linters

00:00:23

passed #184518
lint
lint-submods-branch

00:00:19

passed #184516
lint
lint-testsuite

00:00:21

passed #184517
lint
typecheck-testsuite

00:00:16

 
  Quick Build
passed #184519
x86_64-linux
hadrian-ghc-in-ghci

00:10:46

 
  Build
passed #184522
x86_64-linux
release-x86_64-linux-deb9-dwarf

01:35:46

passed #184521
x86_64-linux
validate-x86_64-linux-deb9-debug

04:15:07

passed #184520
x86_64-linux
validate-x86_64-linux-deb9-hadrian

02:09:53

 
  Full Build
failed #184525
aarch64-linux allowed to fail
nightly-aarch64-linux-deb9

01:03:15

failed #184527
x86_64-linux
nightly-i386-linux-deb9

03:59:39

failed #184539
x86_64-windows allowed to fail
nightly-i386-windows

00:05:31

failed #184536
x86_64-windows allowed to fail
nightly-i386-windows-hadrian

00:03:57

failed #184533
x86_64-linux allowed to fail
nightly-x86_64-linux-alpine

01:55:12

failed #184528
x86_64-linux
nightly-x86_64-linux-deb9

03:31:06

failed #184531
x86_64-linux
nightly-x86_64-linux-deb9-integer-simple

03:44:35

passed #184529
x86_64-linux
nightly-x86_64-linux-deb9-llvm

03:01:13

failed #184538
x86_64-windows allowed to fail
nightly-x86_64-windows

00:45:42

failed #184524
aarch64-linux allowed to fail
validate-aarch64-linux-deb9

01:03:04

passed #184526
x86_64-linux
validate-i386-linux-deb9

01:41:08

passed #184523
x86_64-darwin
validate-x86_64-darwin

00:58:55

passed #184530
x86_64-linux
validate-x86_64-linux-deb9-integer-simple

01:53:50

passed #184532
x86_64-linux
validate-x86_64-linux-deb9-unreg

03:24:44

passed #184534
x86_64-linux
validate-x86_64-linux-fedora27

01:48:24

failed #184537
x86_64-windows allowed to fail
validate-x86_64-windows

00:08:58

failed #184535
x86_64-windows allowed to fail
validate-x86_64-windows-hadrian

00:47:37

 
  Cleanup
passed #184540
x86_64-darwin
cleanup-darwin

00:00:07

 
  Packaging
skipped #184541
x86_64-linux allowed to fail
doc-tarball
 
  Testing
skipped #184542
x86_64-linux allowed to fail manual
hackage
skipped #184543
x86_64-linux
nightly-hackage
skipped #184544
x86_64-linux
perf-nofib
 
  Deploy
skipped #184545
x86_64-linux allowed to fail
pages
 
Name Stage Failure
failed
validate-aarch64-linux-deb9 Full Build
Uploading artifacts...
WARNING: ghc-*.tar.xz: no matching files
WARNING: junit.xml: no matching files
WARNING: performance-metrics.tsv: no matching files
ERROR: No files to upload
Uploading artifacts...
WARNING: junit.xml: no matching files
ERROR: No files to upload
ERROR: Job failed: exit code 1
failed
validate-x86_64-windows Full Build
Runtime platform                                    arch=amd64 os=windows pid=4504 revision=1f513601 version=11.10.1
WARNING: ghc-*.tar.xz: no matching files
WARNING: junit.xml: no matching files
ERROR: No files to upload
Uploading artifacts...
Runtime platform
arch=amd64 os=windows pid=5592 revision=1f513601 version=11.10.1
WARNING: junit.xml: no matching files
ERROR: No files to upload
ERROR: Job failed: exit status 2
failed
validate-x86_64-windows-hadrian Full Build
Runtime platform                                    arch=amd64 os=windows pid=4912 revision=1f513601 version=11.10.1
WARNING: ghc.tar.xz: no matching files
WARNING: junit.xml: no matching files
ERROR: No files to upload
Uploading artifacts...
Runtime platform
arch=amd64 os=windows pid=5592 revision=1f513601 version=11.10.1
WARNING: junit.xml: no matching files
ERROR: No files to upload
ERROR: Job failed: exit status 1
failed
nightly-i386-windows-hadrian Full Build
Runtime platform                                    arch=amd64 os=windows pid=6656 revision=1f513601 version=11.10.1
WARNING: ghc.tar.xz: no matching files
WARNING: junit.xml: no matching files
ERROR: No files to upload
Uploading artifacts...
Runtime platform
arch=amd64 os=windows pid=4212 revision=1f513601 version=11.10.1
WARNING: junit.xml: no matching files
ERROR: No files to upload
ERROR: Job failed: exit status 77
failed
nightly-x86_64-linux-alpine Full Build
Uploading artifacts...
ghc-*.tar.xz: found 1 matching files
junit.xml: found 1 matching files

performance-metrics.tsv: found 1 matching files

Uploading artifacts to coordinator... ok
id=184533 responseStatus=201 Created token=PGNeCKzt
Uploading artifacts...
junit.xml: found 1 matching files

Uploading artifacts to coordinator... ok
id=184533 responseStatus=201 Created token=PGNeCKzt
ERROR: Job failed: exit code 1
failed
nightly-x86_64-linux-deb9-integer-simple Full Build
make[1]: Leaving directory '/builds/ghc/ghc/testsuite/tests'
make: *** [slowtest] Error 2
Makefile:228: recipe for target 'slowtest' failed
Running after script...
$ cp -Rf $HOME/.cabal cabal-cache
Uploading artifacts...
junit.xml: found 1 matching files
Uploading artifacts to coordinator... ok
id=184531 responseStatus=201 Created token=K5aQyndo
ERROR: Job failed: exit code 1
failed
nightly-aarch64-linux-deb9 Full Build
libraries/integer-gmp/ghc.mk:4: recipe for target 'libraries/integer-gmp/dist-install/build/libHSinteger-gmp-1.0.2.0-ghc8.9.0.20191022.so' failed
make: *** [all] Error 2
Makefile:123: recipe for target 'all' failed
Running after script...
$ cp -Rf $HOME/.cabal cabal-cache
Uploading artifacts...
WARNING: junit.xml: no matching files
ERROR: No files to upload
ERROR: Job failed: exit code 1
failed
nightly-i386-linux-deb9 Full Build
Uploading artifacts...
ghc-*.tar.xz: found 1 matching files
junit.xml: found 1 matching files

performance-metrics.tsv: found 1 matching files

Uploading artifacts to coordinator... ok
id=184527 responseStatus=201 Created token=3hnk_9rW
Uploading artifacts...
junit.xml: found 1 matching files

Uploading artifacts to coordinator... ok
id=184527 responseStatus=201 Created token=3hnk_9rW
ERROR: Job failed: exit code 1
failed
nightly-i386-windows Full Build
Runtime platform                                    arch=amd64 os=windows pid=5048 revision=1f513601 version=11.10.1
WARNING: ghc-*.tar.xz: no matching files
WARNING: junit.xml: no matching files
ERROR: No files to upload
Uploading artifacts...
Runtime platform
arch=amd64 os=windows pid=3456 revision=1f513601 version=11.10.1
WARNING: junit.xml: no matching files
ERROR: No files to upload
ERROR: Job failed: exit status 77
failed
nightly-x86_64-windows Full Build
Runtime platform                                    arch=amd64 os=windows pid=5040 revision=1f513601 version=11.10.1
WARNING: ghc-*.tar.xz: no matching files
WARNING: junit.xml: no matching files
ERROR: No files to upload
Uploading artifacts...
Runtime platform
arch=amd64 os=windows pid=5824 revision=1f513601 version=11.10.1
WARNING: junit.xml: no matching files
ERROR: No files to upload
ERROR: Job failed: exit status 2
failed
nightly-x86_64-linux-deb9 Full Build
make[1]: Leaving directory '/builds/ghc/ghc/testsuite/tests'
make: *** [slowtest] Error 2
Makefile:228: recipe for target 'slowtest' failed
Running after script...
$ cp -Rf $HOME/.cabal cabal-cache
Uploading artifacts...
junit.xml: found 1 matching files
Uploading artifacts to coordinator... ok
id=184528 responseStatus=201 Created token=KmhWHtYd
ERROR: Job failed: exit code 1