Fix error message for './configure' regarding '--with-ghc' [skip ci]

25 jobs for master in 363 minutes and 9 seconds (queued for 2 seconds)
Status Job ID Name Coverage
  Lint
passed #70087
lint
lint-submods

00:01:07

 
  Build
passed #70089
x86_64-linux
hadrian-ghc-in-ghci

00:11:58

failed #70088
x86_64-linux allowed to fail
validate-x86_64-linux-deb8-hadrian

02:11:01

passed #70090
x86_64-linux
validate-x86_64-linux-deb9-debug

01:14:45

 
  Full Build
failed #70093
aarch64-linux allowed to fail
nightly-aarch64-linux-deb9

01:08:24

failed #70095
x86_64-linux
nightly-i386-linux-deb9

03:29:48

failed #70105
x86_64-windows allowed to fail
nightly-i386-windows

00:00:00

failed #70103
x86_64-windows
nightly-i386-windows-hadrian

00:45:05

failed #70097
x86_64-linux
nightly-x86_64-linux-deb9

01:45:15

failed #70100
x86_64-linux
nightly-x86_64-linux-deb9-integer-simple

02:09:35

failed #70092
aarch64-linux allowed to fail
validate-aarch64-linux-deb9

01:08:21

passed #70094
x86_64-linux
validate-i386-linux-deb9

01:16:20

passed #70091
x86_64-darwin
validate-x86_64-darwin

00:58:29

passed #70096
x86_64-linux
validate-x86_64-linux-deb9

01:14:42

passed #70099
x86_64-linux
validate-x86_64-linux-deb9-integer-simple

01:19:43

failed #70098
x86_64-linux
validate-x86_64-linux-deb9-llvm

03:19:30

passed #70101
x86_64-linux
validate-x86_64-linux-deb9-unreg

03:25:42

passed #70102
x86_64-linux
validate-x86_64-linux-fedora27

01:21:25

failed #70104
x86_64-windows allowed to fail
validate-x86_64-windows

02:17:36

 
  Cleanup
passed #70107
x86_64-darwin
cleanup-darwin

00:00:06

passed #70106
x86_64-windows
cleanup-windows

00:00:26

 
  Packaging
skipped #70108
x86_64-linux allowed to fail
doc-tarball
 
  Hackage
skipped #70109
x86_64-linux allowed to fail manual
hackage
skipped #70110
x86_64-linux
nightly-hackage
 
  Deploy
skipped #70111
x86_64-linux allowed to fail
pages
 
Name Stage Failure
failed
validate-x86_64-linux-deb8-hadrian Build

fatal: unable to auto-detect email address (got 'ghc@runner-BcnYxdgF-project-1-concurrent-0.(none)')
)


Uploading artifacts...
WARNING: ghc.tar.xz: no matching files
ERROR: No files to upload
ERROR: Job failed: exit code 1
failed
validate-aarch64-linux-deb9 Full Build
$ cp -Rf $HOME/.cabal cabal-cache
Uploading artifacts...
WARNING: ghc-*.tar.xz: no matching files
WARNING: junit.xml: no matching files
ERROR: No files to upload
Uploading artifacts...
WARNING: junit.xml: no matching files
ERROR: No files to upload
ERROR: Job failed: exit code 1
failed
nightly-aarch64-linux-deb9 Full Build
"touch" libffi/stamp.ffi.static-shared.configure
Makefile:123: recipe for target 'all' failed
make: *** [all] Error 2
Running after script...
$ cp -Rf $HOME/.cabal cabal-cache
Uploading artifacts...
WARNING: junit.xml: no matching files
ERROR: No files to upload
ERROR: Job failed: exit code 1
failed
nightly-x86_64-linux-deb9 Full Build
make[1]: *** [slow] Error 2
Makefile:228: recipe for target 'slowtest' failed
make: *** [slowtest] Error 2
Running after script...
$ cp -Rf $HOME/.cabal cabal-cache
Uploading artifacts...
junit.xml: found 1 matching files
Uploading artifacts to coordinator... ok
id=70097 responseStatus=201 Created token=c37zvqPK
ERROR: Job failed: exit code 1
failed
nightly-i386-linux-deb9 Full Build
$ cp -Rf $HOME/.cabal cabal-cache
Uploading artifacts...
ghc-*.tar.xz: found 1 matching files
junit.xml: found 1 matching files

Uploading artifacts to coordinator... ok
id=70095 responseStatus=201 Created token=BtoVvnC-
Uploading artifacts...
junit.xml: found 1 matching files

Uploading artifacts to coordinator... ok
id=70095 responseStatus=201 Created token=BtoVvnC-
ERROR: Job failed: exit code 1
failed
nightly-i386-windows Full Build
Runtime platform                                    arch=amd64 os=windows pid=3276 revision=7f00c780 version=11.5.1
WARNING: ghc-*.tar.xz: no matching files
WARNING: junit.xml: no matching files
ERROR: No files to upload
Uploading artifacts...
Runtime platform
arch=amd64 os=windows pid=3968 revision=7f00c780 version=11.5.1
WARNING: junit.xml: no matching files
ERROR: No files to upload
ERROR: Job failed: exit status 128
failed
nightly-x86_64-linux-deb9-integer-simple Full Build
make[1]: *** [slow] Error 2
Makefile:228: recipe for target 'slowtest' failed
make: *** [slowtest] Error 2
Running after script...
$ cp -Rf $HOME/.cabal cabal-cache
Uploading artifacts...
junit.xml: found 1 matching files
Uploading artifacts to coordinator... ok
id=70100 responseStatus=201 Created token=kSDygK9y
ERROR: Job failed: exit code 1
failed
validate-x86_64-linux-deb9-llvm Full Build
make[1]: Leaving directory '/builds/ghc/ghc/testsuite/tests'
Makefile:224: recipe for target 'test' failed
make: *** [test] Error 2
Running after script...
$ cp -Rf $HOME/.cabal cabal-cache
Uploading artifacts...
junit.xml: found 1 matching files
Uploading artifacts to coordinator... ok
id=70098 responseStatus=201 Created token=NyNSx2w6
ERROR: Job failed: exit code 1
failed
nightly-i386-windows-hadrian Full Build
   Speed :           153947205 Bytes/sec.
Speed : 8808.929 MegaBytes/min.
Ended : Wednesday, April 24, 2019 7:31:35 AM

Uploading artifacts...
Runtime platform arch=amd64 os=windows pid=5448 revision=7f00c780 version=11.5.1
WARNING: ghc.tar.xz: no matching files
ERROR: No files to upload
ERROR: Job failed: exit status 1
failed
validate-x86_64-windows Full Build
junit.xml: found 1 matching files                  
WARNING: Failed to load system CertPool: crypto/x509: system root pool is not available on Windows
Uploading artifacts to coordinator... ok
id=70104 responseStatus=201 Created token=hfkGjyyp
Uploading artifacts...
Runtime platform
arch=amd64 os=windows pid=7096 revision=7f00c780 version=11.5.1
junit.xml: found 1 matching files

WARNING: Failed to load system CertPool: crypto/x509: system root pool is not available on Windows
Uploading artifacts to coordinator... ok
id=70104 responseStatus=201 Created token=hfkGjyyp
ERROR: Job failed: exit status 2