gitlab-ci: Reintroduce DWARF-enabled bindists

It seems that this was inadvertently dropped in
1285d6b9.
26 jobs for master in 663 minutes and 29 seconds (queued for 2 seconds)
Status Name Job ID Coverage
  Lint
passed lint-submods #71968
lint

00:01:07

 
  Build
passed hadrian-ghc-in-ghci #71970
x86_64-linux

00:10:55

failed release-x86_64-linux-deb9-dwarf #71972
x86_64-linux allowed to fail

01:02:56

failed validate-x86_64-linux-deb8-hadrian #71969
x86_64-linux allowed to fail

01:47:47

passed validate-x86_64-linux-deb9-debug #71971
x86_64-linux

00:37:55

 
  Full Build
failed nightly-aarch64-linux-deb9 #71975
aarch64-linux allowed to fail

01:04:45

failed nightly-i386-linux-deb9 #71977
x86_64-linux

02:36:59

failed nightly-i386-windows #71987
x86_64-windows allowed to fail

09:13:40

failed nightly-i386-windows-hadrian #71985
x86_64-windows

00:48:04

failed nightly-x86_64-linux-deb9 #71979
x86_64-linux

01:39:26

failed nightly-x86_64-linux-deb9-integer-simple #71982
x86_64-linux

01:15:50

failed validate-aarch64-linux-deb9 #71974
aarch64-linux allowed to fail

01:04:40

passed validate-i386-linux-deb9 #71976
x86_64-linux

01:02:58

passed validate-x86_64-darwin #71973
x86_64-darwin

01:45:40

passed validate-x86_64-linux-deb9 #71978
x86_64-linux

00:44:51

passed validate-x86_64-linux-deb9-integer-simple #71981
x86_64-linux

01:24:30

failed validate-x86_64-linux-deb9-llvm #71980
x86_64-linux

02:24:56

passed validate-x86_64-linux-deb9-unreg #71983
x86_64-linux

01:55:27

failed validate-x86_64-linux-fedora27 #71984
x86_64-linux

01:21:44

failed validate-x86_64-windows #71986
x86_64-windows allowed to fail

00:31:24

 
  Cleanup
passed cleanup-darwin #71989
x86_64-darwin

00:00:08

passed cleanup-windows #71988
x86_64-windows

00:00:55

 
  Packaging
skipped doc-tarball #71990
x86_64-linux allowed to fail
 
  Hackage
skipped hackage #71991
x86_64-linux allowed to fail manual
skipped nightly-hackage #71992
x86_64-linux
 
  Deploy
skipped pages #71993
x86_64-linux allowed to fail
 
Name Stage Failure
failed
validate-x86_64-linux-deb8-hadrian Build

fatal: unable to auto-detect email address (got 'ghc@runner-e7d5528a-project-1-concurrent-0.(none)')
)


Uploading artifacts...
WARNING: ghc.tar.xz: no matching files
ERROR: No files to upload
ERROR: Job failed: exit code 1
failed
release-x86_64-linux-deb9-dwarf Build
$ cp -Rf $HOME/.cabal cabal-cache
Uploading artifacts...
ghc-*.tar.xz: found 1 matching files
junit.xml: found 1 matching files

Uploading artifacts to coordinator... ok
id=71972 responseStatus=201 Created token=q1Bibwps
Uploading artifacts...
junit.xml: found 1 matching files

Uploading artifacts to coordinator... ok
id=71972 responseStatus=201 Created token=q1Bibwps
ERROR: Job failed: exit code 1
failed
validate-aarch64-linux-deb9 Full Build
$ cp -Rf $HOME/.cabal cabal-cache
Uploading artifacts...
WARNING: ghc-*.tar.xz: no matching files
WARNING: junit.xml: no matching files
ERROR: No files to upload
Uploading artifacts...
WARNING: junit.xml: no matching files
ERROR: No files to upload
ERROR: Job failed: exit code 1
failed
nightly-aarch64-linux-deb9 Full Build
"touch" libffi/stamp.ffi.static-shared.configure
make: *** [all] Error 2
Makefile:123: recipe for target 'all' failed
Running after script...
$ cp -Rf $HOME/.cabal cabal-cache
Uploading artifacts...
WARNING: junit.xml: no matching files
ERROR: No files to upload
ERROR: Job failed: exit code 1
failed
nightly-i386-linux-deb9 Full Build
$ cp -Rf $HOME/.cabal cabal-cache
Uploading artifacts...
ghc-*.tar.xz: found 1 matching files
junit.xml: found 1 matching files

Uploading artifacts to coordinator... ok
id=71977 responseStatus=201 Created token=_hQtLYs_
Uploading artifacts...
junit.xml: found 1 matching files

Uploading artifacts to coordinator... ok
id=71977 responseStatus=201 Created token=_hQtLYs_
ERROR: Job failed: exit code 1
failed
nightly-x86_64-linux-deb9 Full Build
make[1]: *** [slow] Error 2
Makefile:228: recipe for target 'slowtest' failed
make: *** [slowtest] Error 2
Running after script...
$ cp -Rf $HOME/.cabal cabal-cache
Uploading artifacts...
junit.xml: found 1 matching files
Uploading artifacts to coordinator... ok
id=71979 responseStatus=201 Created token=Aqy1xCWV
ERROR: Job failed: exit code 1
failed
validate-x86_64-linux-deb9-llvm Full Build
make[1]: Leaving directory '/builds/ghc/ghc/testsuite/tests'
Makefile:224: recipe for target 'test' failed
make: *** [test] Error 2
Running after script...
$ cp -Rf $HOME/.cabal cabal-cache
Uploading artifacts...
junit.xml: found 1 matching files
Uploading artifacts to coordinator... ok
id=71980 responseStatus=201 Created token=uVkgCtG2
ERROR: Job failed: exit code 1
failed
nightly-x86_64-linux-deb9-integer-simple Full Build
make[1]: *** [slow] Error 2
make: *** [slowtest] Error 2
Makefile:228: recipe for target 'slowtest' failed
Running after script...
$ cp -Rf $HOME/.cabal cabal-cache
Uploading artifacts...
junit.xml: found 1 matching files
Uploading artifacts to coordinator... ok
id=71982 responseStatus=201 Created token=xztx3uP5
ERROR: Job failed: exit code 1
failed
validate-x86_64-linux-fedora27 Full Build
$ cp -Rf $HOME/.cabal cabal-cache
Uploading artifacts...
ghc-*.tar.xz: found 1 matching files
junit.xml: found 1 matching files

Uploading artifacts to coordinator... ok
id=71984 responseStatus=201 Created token=6vrsh26c
Uploading artifacts...
junit.xml: found 1 matching files

Uploading artifacts to coordinator... ok
id=71984 responseStatus=201 Created token=6vrsh26c
ERROR: Job failed: exit code 1
failed
nightly-i386-windows-hadrian Full Build
   Speed :           117144518 Bytes/sec.
Speed : 6703.063 MegaBytes/min.
Ended : Monday, April 29, 2019 6:56:06 AM

Uploading artifacts...
Runtime platform arch=amd64 os=windows pid=648 revision=7f00c780 version=11.5.1
WARNING: ghc.tar.xz: no matching files
ERROR: No files to upload
ERROR: Job failed: exit status 1
failed
validate-x86_64-windows Full Build
Runtime platform                                    arch=amd64 os=windows pid=3960 revision=7f00c780 version=11.5.1
WARNING: ghc-*.tar.xz: no matching files
WARNING: junit.xml: no matching files
ERROR: No files to upload
Uploading artifacts...
Runtime platform
arch=amd64 os=windows pid=3028 revision=7f00c780 version=11.5.1
WARNING: junit.xml: no matching files
ERROR: No files to upload
ERROR: Job failed: exit status 2
failed
nightly-i386-windows Full Build
junit.xml: found 1 matching files                  
WARNING: Failed to load system CertPool: crypto/x509: system root pool is not available on Windows
Uploading artifacts to coordinator... ok
id=71987 responseStatus=201 Created token=GgfRTJRE
Uploading artifacts...
Runtime platform
arch=amd64 os=windows pid=4064 revision=7f00c780 version=11.5.1
junit.xml: found 1 matching files

WARNING: Failed to load system CertPool: crypto/x509: system root pool is not available on Windows
Uploading artifacts to coordinator... ok
id=71987 responseStatus=201 Created token=GgfRTJRE
ERROR: Job failed: exit status 2