[ typo ] 'castFloatToWord32' -> 'castFloatToWord64'

Probably due to a copy/paste gone wrong.
26 jobs for master in 618 minutes and 22 seconds (queued for 2 seconds)
Status Job ID Name Coverage
  Lint
passed #75009
lint
lint-submods

00:01:00

 
  Build
passed #75011
x86_64-linux
hadrian-ghc-in-ghci

00:19:05

failed #75013
x86_64-linux allowed to fail
release-x86_64-linux-deb9-dwarf

00:52:46

failed #75010
x86_64-linux allowed to fail
validate-x86_64-linux-deb8-hadrian

00:11:12

passed #75012
x86_64-linux
validate-x86_64-linux-deb9-debug

00:47:26

 
  Full Build
failed #75016
aarch64-linux allowed to fail
nightly-aarch64-linux-deb9

01:06:08

failed #75018
x86_64-linux
nightly-i386-linux-deb9

01:58:42

failed #75028
x86_64-windows allowed to fail
nightly-i386-windows

09:23:36

failed #75026
x86_64-windows
nightly-i386-windows-hadrian

00:49:13

failed #75020
x86_64-linux
nightly-x86_64-linux-deb9

01:50:06

failed #75023
x86_64-linux
nightly-x86_64-linux-deb9-integer-simple

02:09:23

failed #75015
aarch64-linux allowed to fail
validate-aarch64-linux-deb9

01:06:02

passed #75017
x86_64-linux
validate-i386-linux-deb9

01:16:33

passed #75014
x86_64-darwin
validate-x86_64-darwin

00:56:54

passed #75019
x86_64-linux
validate-x86_64-linux-deb9

01:20:04

passed #75022
x86_64-linux
validate-x86_64-linux-deb9-integer-simple

01:17:27

passed #75021
x86_64-linux
validate-x86_64-linux-deb9-llvm

02:07:07

passed #75024
x86_64-linux
validate-x86_64-linux-deb9-unreg

02:06:56

passed #75025
x86_64-linux
validate-x86_64-linux-fedora27

00:47:36

failed #75027
x86_64-windows allowed to fail
validate-x86_64-windows

02:16:03

 
  Cleanup
passed #75030
x86_64-darwin
cleanup-darwin

00:00:03

passed #75029
x86_64-windows
cleanup-windows

00:00:58

 
  Packaging
skipped #75031
x86_64-linux allowed to fail
doc-tarball
 
  Hackage
skipped #75032
x86_64-linux allowed to fail manual
hackage
skipped #75033
x86_64-linux
nightly-hackage
 
  Deploy
skipped #75034
x86_64-linux allowed to fail
pages
 
Name Stage Failure
failed
validate-x86_64-linux-deb8-hadrian Build
Failed to download semigroups-0.18.5 (which is required by exe:hadrian from
hadrian-0.1.0.0). The exception was:
user error (hTryLock: lock already exists:
/home/ghc/.cabal/packages/hackage.haskell.org/hackage-security-lock)

Uploading artifacts...
WARNING: junit.xml: no matching files
ERROR: No files to upload
ERROR: Job failed: exit code 1
failed
nightly-i386-windows Full Build
junit.xml: found 1 matching files                  
WARNING: Failed to load system CertPool: crypto/x509: system root pool is not available on Windows
Uploading artifacts to coordinator... ok
id=75028 responseStatus=201 Created token=ywxKxy6G
Uploading artifacts...
Runtime platform
arch=amd64 os=windows pid=3896 revision=7f00c780 version=11.5.1
junit.xml: found 1 matching files

WARNING: Failed to load system CertPool: crypto/x509: system root pool is not available on Windows
Uploading artifacts to coordinator... ok
id=75028 responseStatus=201 Created token=ywxKxy6G
ERROR: Job failed: exit status 2
failed
validate-aarch64-linux-deb9 Full Build
$ cp -Rf $HOME/.cabal cabal-cache
Uploading artifacts...
WARNING: ghc-*.tar.xz: no matching files
WARNING: junit.xml: no matching files
ERROR: No files to upload
Uploading artifacts...
WARNING: junit.xml: no matching files
ERROR: No files to upload
ERROR: Job failed: exit code 1
failed
nightly-aarch64-linux-deb9 Full Build
"touch" libffi/stamp.ffi.static-shared.configure
make: *** [all] Error 2
Makefile:123: recipe for target 'all' failed
Running after script...
$ cp -Rf $HOME/.cabal cabal-cache
Uploading artifacts...
WARNING: junit.xml: no matching files
ERROR: No files to upload
ERROR: Job failed: exit code 1
failed
nightly-x86_64-linux-deb9 Full Build
make[1]: Leaving directory '/builds/ghc/ghc/testsuite/tests'
Makefile:228: recipe for target 'slowtest' failed
make: *** [slowtest] Error 2
Running after script...
$ cp -Rf $HOME/.cabal cabal-cache
Uploading artifacts...
junit.xml: found 1 matching files
Uploading artifacts to coordinator... ok
id=75020 responseStatus=201 Created token=CccKft8H
ERROR: Job failed: exit code 1
failed
nightly-i386-linux-deb9 Full Build
$ cp -Rf $HOME/.cabal cabal-cache
Uploading artifacts...
ghc-*.tar.xz: found 1 matching files
junit.xml: found 1 matching files

Uploading artifacts to coordinator... ok
id=75018 responseStatus=201 Created token=oj9hvzKC
Uploading artifacts...
junit.xml: found 1 matching files

Uploading artifacts to coordinator... ok
id=75018 responseStatus=201 Created token=oj9hvzKC
ERROR: Job failed: exit code 1
failed
nightly-x86_64-linux-deb9-integer-simple Full Build
make[1]: *** [slow] Error 2
make: *** [slowtest] Error 2
Makefile:228: recipe for target 'slowtest' failed
Running after script...
$ cp -Rf $HOME/.cabal cabal-cache
Uploading artifacts...
junit.xml: found 1 matching files
Uploading artifacts to coordinator... ok
id=75023 responseStatus=201 Created token=xz79QzVS
ERROR: Job failed: exit code 1
failed
release-x86_64-linux-deb9-dwarf Build
$ cp -Rf $HOME/.cabal cabal-cache
Uploading artifacts...
ghc-*.tar.xz: found 1 matching files
junit.xml: found 1 matching files

Uploading artifacts to coordinator... ok
id=75013 responseStatus=201 Created token=JXPVqPGj
Uploading artifacts...
junit.xml: found 1 matching files

Uploading artifacts to coordinator... ok
id=75013 responseStatus=201 Created token=JXPVqPGj
ERROR: Job failed: exit code 1
failed
nightly-i386-windows-hadrian Full Build
   Speed :            27431821 Bytes/sec.
Speed : 1569.661 MegaBytes/min.
Ended : Monday, May 6, 2019 6:02:36 AM

Uploading artifacts...
Runtime platform arch=amd64 os=windows pid=6704 revision=7f00c780 version=11.5.1
WARNING: ghc.tar.xz: no matching files
ERROR: No files to upload
ERROR: Job failed: exit status 1
failed
validate-x86_64-windows Full Build
junit.xml: found 1 matching files                  
WARNING: Failed to load system CertPool: crypto/x509: system root pool is not available on Windows
Uploading artifacts to coordinator... ok
id=75027 responseStatus=201 Created token=kJk5bstJ
Uploading artifacts...
Runtime platform
arch=amd64 os=windows pid=3380 revision=7f00c780 version=11.5.1
junit.xml: found 1 matching files

WARNING: Failed to load system CertPool: crypto/x509: system root pool is not available on Windows
Uploading artifacts to coordinator... ok
id=75027 responseStatus=201 Created token=kJk5bstJ
ERROR: Job failed: exit status 2