Enable external interpreter when TH is requested but no internal interpreter is available


(cherry picked from commit e172a6d1)
18 jobs for !1011 with cherry-pick-e172a6d1 in 339 minutes and 55 seconds (queued for 4 seconds)
detached
Status Job ID Name Coverage
  Lint
passed #90832
lint
ghc-linters

00:00:16

passed #90833
lint
lint-submods-mr

00:00:15

 
  Build
failed #90836
x86_64-linux allowed to fail
release-x86_64-linux-deb9-dwarf

00:05:17

passed #90834
x86_64-linux
validate-x86_64-linux-deb8-hadrian

01:56:36

passed #90835
x86_64-linux
validate-x86_64-linux-deb9-debug

01:14:27

 
  Full Build
failed #90838
aarch64-linux allowed to fail
validate-aarch64-linux-deb9

00:00:00

passed #90839
x86_64-linux
validate-i386-linux-deb9

01:09:41

passed #90837
x86_64-darwin
validate-x86_64-darwin

00:57:24

passed #90840
x86_64-linux
validate-x86_64-linux-deb9

01:31:49

failed #90842
x86_64-linux allowed to fail
validate-x86_64-linux-deb9-integer-simple

00:38:07

failed #90841
x86_64-linux allowed to fail
validate-x86_64-linux-deb9-llvm

02:01:49

failed #90843
x86_64-linux allowed to fail
validate-x86_64-linux-deb9-unreg

01:57:51

passed #90844
x86_64-linux
validate-x86_64-linux-fedora27

01:12:02

failed #90846
x86_64-windows allowed to fail
validate-x86_64-windows

02:48:28

failed #90845
x86_64-windows allowed to fail
validate-x86_64-windows-hadrian

00:14:02

 
  Cleanup
passed #90848
x86_64-darwin
cleanup-darwin

00:00:12

passed #90847
x86_64-windows
cleanup-windows

00:00:24

 
  Hackage
manual #90849
x86_64-linux allowed to fail manual
hackage
 
Name Stage Failure
failed
release-x86_64-linux-deb9-dwarf Build
$ cp -Rf $HOME/.cabal cabal-cache
Uploading artifacts...
WARNING: ghc-*.tar.xz: no matching files
WARNING: junit.xml: no matching files
ERROR: No files to upload
Uploading artifacts...
WARNING: junit.xml: no matching files
ERROR: No files to upload
ERROR: Job failed: exit code 1
failed
validate-x86_64-linux-deb9-llvm Full Build
make[1]: Leaving directory '/builds/ghc/ghc/testsuite/tests'
make: *** [test] Error 2
Makefile:224: recipe for target 'test' failed
Running after script...
$ cp -Rf $HOME/.cabal cabal-cache
Uploading artifacts...
junit.xml: found 1 matching files
Uploading artifacts to coordinator... ok
id=90841 responseStatus=201 Created token=cyseMtvM
ERROR: Job failed: exit code 1
failed
validate-aarch64-linux-deb9 Full Build
Running with gitlab-runner 11.12.0~beta.1460.g3aac76a8 (3aac76a8)
on centriq.haskell.org 3bed8b97
Using Docker executor with image registry.gitlab.haskell.org/ghc/ci-images/aarch64-linux-deb9:cefaee3c742af193e0f7783f87edb0d35374515c ...
Pulling docker image gitlab/gitlab-runner-helper:arm-3aac76a8 ...
ERROR: Job failed: Error response from daemon: manifest for gitlab/gitlab-runner-helper:arm-3aac76a8 not found (executor_docker.go:173:0s)
failed
validate-x86_64-linux-deb9-integer-simple Full Build
libraries/text/ghc.mk:4: recipe for target 'libraries/text/dist-install/build/Data/Text/Lazy/Builder/Int.o' failed
Makefile:123: recipe for target 'all' failed
make: *** [all] Error 2
Running after script...
$ cp -Rf $HOME/.cabal cabal-cache
Uploading artifacts...
WARNING: junit.xml: no matching files
ERROR: No files to upload
ERROR: Job failed: exit code 1
failed
validate-x86_64-linux-deb9-unreg Full Build
make[1]: Leaving directory '/builds/ghc/ghc/testsuite/tests'
Makefile:224: recipe for target 'test' failed
make: *** [test] Error 2
Running after script...
$ cp -Rf $HOME/.cabal cabal-cache
Uploading artifacts...
junit.xml: found 1 matching files
Uploading artifacts to coordinator... ok
id=90843 responseStatus=201 Created token=bpP1YSj3
ERROR: Job failed: exit code 1
failed
validate-x86_64-windows-hadrian Full Build
   Speed :            21026367 Bytes/sec.
Speed : 1203.138 MegaBytes/min.
Ended : Tuesday, June 4, 2019 7:57:07 AM

Uploading artifacts...
Runtime platform arch=amd64 os=windows pid=2380 revision=1f513601 version=11.10.1
WARNING: ghc.tar.xz: no matching files
ERROR: No files to upload
ERROR: Job failed: exit status 1
failed
validate-x86_64-windows Full Build
junit.xml: found 1 matching files                  
WARNING: Failed to load system CertPool:crypto/x509: system root pool is not available on Windows
Uploading artifacts to coordinator... ok
id=90846 responseStatus=201 Created token=zgQ8Egx6
Uploading artifacts...
Runtime platform
arch=amd64 os=windows pid=6964 revision=1f513601 version=11.10.1
junit.xml: found 1 matching files

WARNING: Failed to load system CertPool:crypto/x509: system root pool is not available on Windows
Uploading artifacts to coordinator... ok
id=90846 responseStatus=201 Created token=zgQ8Egx6
ERROR: Job failed: exit status 2