gitlab-ci: Bump Docker image

Fixes linters.
26 jobs for master in 654 minutes and 28 seconds (queued for 2 seconds)
Status Job ID Name Coverage
  Lint
passed #101598
lint
lint-submods-branch

00:01:33

 
  Build
passed #101600
x86_64-linux
hadrian-ghc-in-ghci

00:17:32

failed #101602
x86_64-linux allowed to fail
release-x86_64-linux-deb9-dwarf

00:50:38

passed #101601
x86_64-linux
validate-x86_64-linux-deb9-debug

01:03:02

passed #101599
x86_64-linux
validate-x86_64-linux-deb9-hadrian

01:19:00

 
  Full Build
failed #101605
aarch64-linux allowed to fail
nightly-aarch64-linux-deb9

01:07:27

failed #101607
x86_64-linux
nightly-i386-linux-deb9

01:35:06

failed #101618
x86_64-windows allowed to fail
nightly-i386-windows

09:33:46

failed #101616
x86_64-windows allowed to fail
nightly-i386-windows-hadrian

00:27:04

failed #101609
x86_64-linux
nightly-x86_64-linux-deb9

01:25:26

failed #101612
x86_64-linux
nightly-x86_64-linux-deb9-integer-simple

02:56:02

failed #101604
aarch64-linux allowed to fail
validate-aarch64-linux-deb9

01:06:38

passed #101606
x86_64-linux
validate-i386-linux-deb9

00:51:51

passed #101603
x86_64-darwin
validate-x86_64-darwin

00:57:31

passed #101608
x86_64-linux
validate-x86_64-linux-deb9

01:41:51

passed #101611
x86_64-linux
validate-x86_64-linux-deb9-integer-simple

01:05:10

passed #101610
x86_64-linux
validate-x86_64-linux-deb9-llvm

02:56:22

passed #101613
x86_64-linux
validate-x86_64-linux-deb9-unreg

01:47:12

passed #101614
x86_64-linux
validate-x86_64-linux-fedora27

01:42:09

failed #101617
x86_64-windows allowed to fail
validate-x86_64-windows

02:20:20

passed #101615
x86_64-windows
validate-x86_64-windows-hadrian

01:22:30

 
  Cleanup
passed #101619
x86_64-darwin
cleanup-darwin

00:00:05

 
  Packaging
skipped #101620
x86_64-linux allowed to fail
doc-tarball
 
  Hackage
skipped #101621
x86_64-linux allowed to fail manual
hackage
skipped #101622
x86_64-linux
nightly-hackage
 
  Deploy
skipped #101623
x86_64-linux allowed to fail
pages
 
Name Stage Failure
failed
nightly-i386-windows-hadrian Full Build
   Speed :           112112669 Bytes/sec.
Speed : 6415.138 MegaBytes/min.
Ended : Thursday, June 13, 2019 6:06:55 AM

Uploading artifacts...
Runtime platform arch=amd64 os=windows pid=6184 revision=1f513601 version=11.10.1
WARNING: ghc.tar.xz: no matching files
ERROR: No files to upload
ERROR: Job failed: exit status 1
failed
validate-aarch64-linux-deb9 Full Build
$ cp -Rf $HOME/.cabal cabal-cache
Uploading artifacts...
WARNING: ghc-*.tar.xz: no matching files
WARNING: junit.xml: no matching files
ERROR: No files to upload
Uploading artifacts...
WARNING: junit.xml: no matching files
ERROR: No files to upload
ERROR: Job failed: exit code 1
failed
nightly-aarch64-linux-deb9 Full Build
make[1]: *** Waiting for unfinished jobs....
Makefile:123: recipe for target 'all' failed
make: *** [all] Error 2
Running after script...
$ cp -Rf $HOME/.cabal cabal-cache
Uploading artifacts...
WARNING: junit.xml: no matching files
ERROR: No files to upload
ERROR: Job failed: exit code 1
failed
nightly-x86_64-linux-deb9 Full Build
make[1]: Leaving directory '/builds/ghc/ghc/testsuite/tests'
make: *** [slowtest] Error 2
Makefile:228: recipe for target 'slowtest' failed
Running after script...
$ cp -Rf $HOME/.cabal cabal-cache
Uploading artifacts...
junit.xml: found 1 matching files
Uploading artifacts to coordinator... ok
id=101609 responseStatus=201 Created token=sAfrvGgi
ERROR: Job failed: exit code 1
failed
nightly-i386-linux-deb9 Full Build
$ cp -Rf $HOME/.cabal cabal-cache
Uploading artifacts...
ghc-*.tar.xz: found 1 matching files
junit.xml: found 1 matching files

Uploading artifacts to coordinator... ok
id=101607 responseStatus=201 Created token=ExvcftUE
Uploading artifacts...
junit.xml: found 1 matching files

Uploading artifacts to coordinator... ok
id=101607 responseStatus=201 Created token=ExvcftUE
ERROR: Job failed: exit code 1
failed
validate-x86_64-windows Full Build There has been a timeout failure or the job got stuck. Check your timeout limits or try again
realgcc.exe: error: CreateProcess: No such file or directory
`gcc.exe' failed in phase `Assembler'. (Exit code: 1)
Unable to start C:\GitLabRunner\builds\pA2hwqzM\0\ghc\ghc\inplace\mingw\bin/realgcc.exe (error code: 19)
`gcc.exe' failed in phase `Assembler'. (Exit code: 1)
realgcc.exe: error: CreateProcess: No such file or directory
`gcc.exe' failed in phase `Assembler'. (Exit code: 1)
make[1]: *** [rts/ghc.mk:318: rts/dist/build/Linker.thr_debug_o] Error 1
make[1]: *** Waiting for unfinished jobs....
make[1]: *** [rts/ghc.mk:318: rts/dist/build/RtsSymbolInfo.thr_debug_o] Error 1
make[1]: *** [rts/ghc.mk:318: rts/dist/build/RtsDllMain.thr_debug_o] Error 1
failed
release-x86_64-linux-deb9-dwarf Build
$ cp -Rf $HOME/.cabal cabal-cache
Uploading artifacts...
ghc-*.tar.xz: found 1 matching files
junit.xml: found 1 matching files

Uploading artifacts to coordinator... ok
id=101602 responseStatus=201 Created token=Kze_hvmF
Uploading artifacts...
junit.xml: found 1 matching files

Uploading artifacts to coordinator... ok
id=101602 responseStatus=201 Created token=Kze_hvmF
ERROR: Job failed: exit code 1
failed
nightly-x86_64-linux-deb9-integer-simple Full Build
make[1]: *** [slow] Error 2
make: *** [slowtest] Error 2
Makefile:228: recipe for target 'slowtest' failed
Running after script...
$ cp -Rf $HOME/.cabal cabal-cache
Uploading artifacts...
junit.xml: found 1 matching files
Uploading artifacts to coordinator... ok
id=101612 responseStatus=201 Created token=w44u98oX
ERROR: Job failed: exit code 1
failed
nightly-i386-windows Full Build
junit.xml: found 1 matching files                  
WARNING: Failed to load system CertPool:crypto/x509: system root pool is not available on Windows
Uploading artifacts to coordinator... ok
id=101618 responseStatus=201 Created token=64xjAZsz
Uploading artifacts...
Runtime platform
arch=amd64 os=windows pid=1660 revision=1f513601 version=11.10.1
junit.xml: found 1 matching files

WARNING: Failed to load system CertPool:crypto/x509: system root pool is not available on Windows
Uploading artifacts to coordinator... ok
id=101618 responseStatus=201 Created token=64xjAZsz
ERROR: Job failed: exit status 2