Add dwarf flavour definition

20 jobs for !1152 with wip/ghc-8.8-merges in 413 minutes and 17 seconds (queued for 17 seconds)
detached
Status Job ID Name Coverage
  Lint
passed #102250
lint
ghc-linters

00:00:15

passed #102251
lint
lint-submods-mr

00:00:15

 
  Build
failed #102254
x86_64-linux allowed to fail
release-x86_64-linux-deb9-dwarf

01:51:21

passed #102252
x86_64-linux
validate-x86_64-linux-deb8-hadrian

03:37:25

passed #102253
x86_64-linux
validate-x86_64-linux-deb9-debug

01:25:51

 
  Full Build
failed #102256
aarch64-linux allowed to fail
validate-aarch64-linux-deb9

00:58:50

passed #102257
x86_64-linux
validate-i386-linux-deb9

01:00:35

passed #102255
x86_64-darwin
validate-x86_64-darwin

00:57:44

passed #102258
x86_64-linux
validate-x86_64-linux-deb9

01:11:47

failed #102260
x86_64-linux allowed to fail
validate-x86_64-linux-deb9-integer-simple

00:35:30

failed #102259
x86_64-linux allowed to fail
validate-x86_64-linux-deb9-llvm

01:44:07

passed #102261
x86_64-linux
validate-x86_64-linux-deb9-unreg

01:47:19

passed #102262
x86_64-linux
validate-x86_64-linux-fedora27

01:12:39

failed #102264
x86_64-windows allowed to fail
validate-x86_64-windows

02:55:55

failed #102437
x86_64-windows allowed to fail
validate-x86_64-windows-hadrian

00:10:44

failed #102423
x86_64-windows allowed to fail
validate-x86_64-windows-hadrian

00:10:36

failed #102263
x86_64-windows allowed to fail
validate-x86_64-windows-hadrian

00:00:34

 
  Cleanup
passed #102266
x86_64-darwin
cleanup-darwin

00:00:08

passed #102265
x86_64-windows
cleanup-windows

00:00:20

 
  Hackage
manual #102267
x86_64-linux allowed to fail manual
hackage
 
Name Stage Failure
failed
validate-aarch64-linux-deb9 Full Build
$ cp -Rf $HOME/.cabal cabal-cache
Uploading artifacts...
WARNING: ghc-*.tar.xz: no matching files
WARNING: junit.xml: no matching files
ERROR: No files to upload
Uploading artifacts...
WARNING: junit.xml: no matching files
ERROR: No files to upload
ERROR: Job failed: exit code 1
failed
validate-x86_64-windows-hadrian Full Build
   Speed :           117001138 Bytes/sec.
Speed : 6694.858 MegaBytes/min.
Ended : Thursday, June 13, 2019 9:18:14 PM

Uploading artifacts...
Runtime platform arch=amd64 os=windows pid=6780 revision=1f513601 version=11.10.1
WARNING: ghc.tar.xz: no matching files
ERROR: No files to upload
ERROR: Job failed: exit status 1
failed
validate-x86_64-windows Full Build
junit.xml: found 1 matching files                  
WARNING: Failed to load system CertPool:crypto/x509: system root pool is not available on Windows
Uploading artifacts to coordinator... ok
id=102264 responseStatus=201 Created token=1TNuRszE
Uploading artifacts...
Runtime platform
arch=amd64 os=windows pid=6352 revision=1f513601 version=11.10.1
junit.xml: found 1 matching files

WARNING: Failed to load system CertPool:crypto/x509: system root pool is not available on Windows
Uploading artifacts to coordinator... ok
id=102264 responseStatus=201 Created token=1TNuRszE
ERROR: Job failed: exit status 2
failed
validate-x86_64-linux-deb9-llvm Full Build
make[1]: *** [test] Error 1
make: *** [test] Error 2
Makefile:224: recipe for target 'test' failed
Running after script...
$ cp -Rf $HOME/.cabal cabal-cache
Uploading artifacts...
junit.xml: found 1 matching files
Uploading artifacts to coordinator... ok
id=102259 responseStatus=201 Created token=2Pp3Ucuq
ERROR: Job failed: exit code 1
failed
validate-x86_64-linux-deb9-integer-simple Full Build
make[1]: *** Waiting for unfinished jobs....
make: *** [all] Error 2
Makefile:123: recipe for target 'all' failed
Running after script...
$ cp -Rf $HOME/.cabal cabal-cache
Uploading artifacts...
WARNING: junit.xml: no matching files
ERROR: No files to upload
ERROR: Job failed: exit code 1
failed
release-x86_64-linux-deb9-dwarf Build
$ cp -Rf $HOME/.cabal cabal-cache
Uploading artifacts...
ghc-*.tar.xz: found 1 matching files
junit.xml: found 1 matching files

Uploading artifacts to coordinator... ok
id=102254 responseStatus=201 Created token=Yo9qyV7G
Uploading artifacts...
junit.xml: found 1 matching files

Uploading artifacts to coordinator... ok
id=102254 responseStatus=201 Created token=Yo9qyV7G
ERROR: Job failed: exit code 1