Add link to mfix.github.io/ghc in HACKING.md

28 jobs for master in 884 minutes and 39 seconds (queued for 2 seconds)
Status Job ID Name Coverage
  Lint
passed #105270
lint
lint-linters

00:00:19

passed #105272
lint
lint-submods-branch

00:00:15

passed #105271
lint
lint-testsuite

00:00:14

 
  Build
passed #105274
x86_64-linux
hadrian-ghc-in-ghci

00:19:07

passed #105276
x86_64-linux
release-x86_64-linux-deb9-dwarf

01:10:31

passed #105450
x86_64-linux
validate-x86_64-linux-deb9-debug

02:31:13

passed #105273
x86_64-linux
validate-x86_64-linux-deb9-hadrian

02:14:47

failed #105275
x86_64-linux
validate-x86_64-linux-deb9-debug

01:49:19

 
  Full Build
failed #105279
aarch64-linux allowed to fail
nightly-aarch64-linux-deb9

05:05:44

failed #105281
x86_64-linux
nightly-i386-linux-deb9

03:09:49

failed #105291
x86_64-windows allowed to fail
nightly-i386-windows

09:32:14

failed #105289
x86_64-windows allowed to fail
nightly-i386-windows-hadrian

00:28:03

failed #105282
x86_64-linux
nightly-x86_64-linux-deb9

02:47:22

failed #105285
x86_64-linux
nightly-x86_64-linux-deb9-integer-simple

01:09:57

passed #105283
x86_64-linux
nightly-x86_64-linux-deb9-llvm

02:57:58

failed #105278
aarch64-linux allowed to fail
validate-aarch64-linux-deb9

03:23:09

passed #105280
x86_64-linux
validate-i386-linux-deb9

01:15:49

passed #105277
x86_64-darwin
validate-x86_64-darwin

00:57:25

passed #105284
x86_64-linux
validate-x86_64-linux-deb9-integer-simple

01:05:51

passed #105286
x86_64-linux
validate-x86_64-linux-deb9-unreg

03:10:02

passed #105287
x86_64-linux
validate-x86_64-linux-fedora27

01:06:57

failed #105290
x86_64-windows allowed to fail
validate-x86_64-windows

02:29:37

passed #105288
x86_64-windows
validate-x86_64-windows-hadrian

01:23:04

 
  Cleanup
passed #105292
x86_64-darwin
cleanup-darwin

00:00:08

 
  Packaging
skipped #105293
x86_64-linux allowed to fail
doc-tarball
 
  Hackage
skipped #105294
x86_64-linux allowed to fail manual
hackage
skipped #105295
x86_64-linux
nightly-hackage
 
  Deploy
skipped #105296
x86_64-linux allowed to fail
pages
 
Name Stage Failure
failed
nightly-i386-windows-hadrian Full Build
   Speed :           104858553 Bytes/sec.
Speed : 6000.054 MegaBytes/min.
Ended : Tuesday, June 18, 2019 6:33:02 PM

Uploading artifacts...
Runtime platform arch=amd64 os=windows pid=4168 revision=1f513601 version=11.10.1
WARNING: ghc.tar.xz: no matching files
ERROR: No files to upload
ERROR: Job failed: exit status 1
failed
nightly-i386-windows Full Build
junit.xml: found 1 matching files                  
WARNING: Failed to load system CertPool:crypto/x509: system root pool is not available on Windows
Uploading artifacts to coordinator... ok
id=105291 responseStatus=201 Created token=Wz5HZQGg
Uploading artifacts...
Runtime platform
arch=amd64 os=windows pid=4812 revision=1f513601 version=11.10.1
junit.xml: found 1 matching files

WARNING: Failed to load system CertPool:crypto/x509: system root pool is not available on Windows
Uploading artifacts to coordinator... ok
id=105291 responseStatus=201 Created token=Wz5HZQGg
ERROR: Job failed: exit status 2
failed
nightly-x86_64-linux-deb9-integer-simple Full Build
make[1]: Leaving directory '/builds/ghc/ghc/testsuite/tests'
make: *** [slowtest] Error 2
Makefile:228: recipe for target 'slowtest' failed
Running after script...
$ cp -Rf $HOME/.cabal cabal-cache
Uploading artifacts...
junit.xml: found 1 matching files
Uploading artifacts to coordinator... ok
id=105285 responseStatus=201 Created token=ao3MQ96P
ERROR: Job failed: exit code 1
failed
validate-x86_64-windows Full Build
junit.xml: found 1 matching files                  
WARNING: Failed to load system CertPool:crypto/x509: system root pool is not available on Windows
Uploading artifacts to coordinator... ok
id=105290 responseStatus=201 Created token=bLzWVeRQ
Uploading artifacts...
Runtime platform
arch=amd64 os=windows pid=952 revision=1f513601 version=11.10.1
junit.xml: found 1 matching files

WARNING: Failed to load system CertPool:crypto/x509: system root pool is not available on Windows
Uploading artifacts to coordinator... ok
id=105290 responseStatus=201 Created token=bLzWVeRQ
ERROR: Job failed: exit status 2
failed
nightly-x86_64-linux-deb9 Full Build
make[1]: Leaving directory '/builds/ghc/ghc/testsuite/tests'
make: *** [slowtest] Error 2
Makefile:228: recipe for target 'slowtest' failed
Running after script...
$ cp -Rf $HOME/.cabal cabal-cache
Uploading artifacts...
junit.xml: found 1 matching files
Uploading artifacts to coordinator... ok
id=105282 responseStatus=201 Created token=N4hWDc1s
ERROR: Job failed: exit code 1
failed
nightly-i386-linux-deb9 Full Build
$ cp -Rf $HOME/.cabal cabal-cache
Uploading artifacts...
ghc-*.tar.xz: found 1 matching files
junit.xml: found 1 matching files

Uploading artifacts to coordinator... ok
id=105281 responseStatus=201 Created token=dva478WW
Uploading artifacts...
junit.xml: found 1 matching files

Uploading artifacts to coordinator... ok
id=105281 responseStatus=201 Created token=dva478WW
ERROR: Job failed: exit code 1
failed
validate-aarch64-linux-deb9 Full Build
$ cp -Rf $HOME/.cabal cabal-cache
Uploading artifacts...
ghc-*.tar.xz: found 1 matching files
junit.xml: found 1 matching files

Uploading artifacts to coordinator... ok
id=105278 responseStatus=201 Created token=DhpG3tKM
Uploading artifacts...
junit.xml: found 1 matching files

Uploading artifacts to coordinator... ok
id=105278 responseStatus=201 Created token=DhpG3tKM
ERROR: Job failed: exit code 1
failed
nightly-aarch64-linux-deb9 Full Build
make[1]: *** [slow] Error 2
Makefile:228: recipe for target 'slowtest' failed
make: *** [slowtest] Error 2
Running after script...
$ cp -Rf $HOME/.cabal cabal-cache
Uploading artifacts...
junit.xml: found 1 matching files
Uploading artifacts to coordinator... ok
id=105279 responseStatus=201 Created token=s-d47pzZ
ERROR: Job failed: exit code 1