Windows: make openTempFile fully atomic.

31 jobs for master in 408 minutes and 50 seconds (queued for 3 seconds)
Status Job ID Name Coverage
  Lint
passed #154225
lint
lint-linters

00:00:21

passed #154228
lint
lint-submods-branch

00:00:17

passed #154226
lint
lint-testsuite

00:00:16

passed #154227
lint
typecheck-testsuite

00:00:16

 
  Build
passed #154230
x86_64-linux
hadrian-ghc-in-ghci

00:18:03

passed #154232
x86_64-linux
release-x86_64-linux-deb9-dwarf

01:36:45

passed #154231
x86_64-linux
validate-x86_64-linux-deb9-debug

03:30:45

passed #154229
x86_64-linux
validate-x86_64-linux-deb9-hadrian

01:55:39

 
  Full Build
failed #154235
aarch64-linux allowed to fail
nightly-aarch64-linux-deb9

00:58:24

failed #154237
x86_64-linux
nightly-i386-linux-deb9

02:06:41

failed #154249
x86_64-windows allowed to fail
nightly-i386-windows

00:00:03

failed #154246
x86_64-windows allowed to fail
nightly-i386-windows-hadrian

00:00:26

failed #154243
x86_64-linux allowed to fail
nightly-x86_64-linux-alpine

01:56:39

failed #154238
x86_64-linux
nightly-x86_64-linux-deb9

03:13:30

passed #154241
x86_64-linux
nightly-x86_64-linux-deb9-integer-simple

02:50:28

failed #154239
x86_64-linux
nightly-x86_64-linux-deb9-llvm

03:17:20

failed #154248
x86_64-windows allowed to fail
nightly-x86_64-windows

00:00:03

failed #154234
aarch64-linux allowed to fail
validate-aarch64-linux-deb9

01:00:05

passed #154236
x86_64-linux
validate-i386-linux-deb9

01:06:30

passed #154233
x86_64-darwin
validate-x86_64-darwin

00:56:25

passed #154240
x86_64-linux
validate-x86_64-linux-deb9-integer-simple

01:46:23

passed #154242
x86_64-linux
validate-x86_64-linux-deb9-unreg

01:44:57

passed #154244
x86_64-linux
validate-x86_64-linux-fedora27

01:37:49

failed #154247
x86_64-windows allowed to fail
validate-x86_64-windows

00:00:14

failed #154245
x86_64-windows allowed to fail
validate-x86_64-windows-hadrian

00:00:56

 
  Cleanup
passed #154250
x86_64-darwin
cleanup-darwin

00:00:05

 
  Packaging
skipped #154251
x86_64-linux allowed to fail
doc-tarball
 
  Testing
skipped #154252
x86_64-linux allowed to fail manual
hackage
skipped #154253
x86_64-linux
nightly-hackage
skipped #154254
x86_64-linux
perf-nofib
 
  Deploy
skipped #154255
x86_64-linux allowed to fail
pages
 
Name Stage Failure
failed
validate-aarch64-linux-deb9 Full Build
$ cp -Rf $HOME/.cabal cabal-cache
Uploading artifacts...
WARNING: ghc-*.tar.xz: no matching files
WARNING: junit.xml: no matching files
ERROR: No files to upload
Uploading artifacts...
WARNING: junit.xml: no matching files
ERROR: No files to upload
ERROR: Job failed: exit code 1
failed
nightly-i386-windows-hadrian Full Build
Runtime platform                                    arch=amd64 os=windows pid=3540 revision=1f513601 version=11.10.1
WARNING: ghc.tar.xz: no matching files
WARNING: junit.xml: no matching files
ERROR: No files to upload
Uploading artifacts...
Runtime platform
arch=amd64 os=windows pid=3284 revision=1f513601 version=11.10.1
WARNING: junit.xml: no matching files
ERROR: No files to upload
ERROR: Job failed: exit status 1
failed
nightly-x86_64-windows Full Build
Runtime platform                                    arch=amd64 os=windows pid=6360 revision=1f513601 version=11.10.1
WARNING: ghc-*.tar.xz: no matching files
WARNING: junit.xml: no matching files
ERROR: No files to upload
Uploading artifacts...
Runtime platform
arch=amd64 os=windows pid=3392 revision=1f513601 version=11.10.1
WARNING: junit.xml: no matching files
ERROR: No files to upload
ERROR: Job failed: exit status 1
failed
validate-x86_64-windows Full Build
Runtime platform                                    arch=amd64 os=windows pid=2768 revision=1f513601 version=11.10.1
WARNING: ghc-*.tar.xz: no matching files
WARNING: junit.xml: no matching files
ERROR: No files to upload
Uploading artifacts...
Runtime platform
arch=amd64 os=windows pid=3016 revision=1f513601 version=11.10.1
WARNING: junit.xml: no matching files
ERROR: No files to upload
ERROR: Job failed: exit status 1
failed
nightly-x86_64-linux-alpine Full Build
$ cp -Rf $HOME/.cabal cabal-cache
Uploading artifacts...
ghc-*.tar.xz: found 1 matching files
junit.xml: found 1 matching files

Uploading artifacts to coordinator... ok
id=154243 responseStatus=201 Created token=ws-LR_sx
Uploading artifacts...
junit.xml: found 1 matching files

Uploading artifacts to coordinator... ok
id=154243 responseStatus=201 Created token=ws-LR_sx
ERROR: Job failed: exit code 1
failed
nightly-i386-windows Full Build
Runtime platform                                    arch=amd64 os=windows pid=4724 revision=1f513601 version=11.10.1
WARNING: ghc-*.tar.xz: no matching files
WARNING: junit.xml: no matching files
ERROR: No files to upload
Uploading artifacts...
Runtime platform
arch=amd64 os=windows pid=3280 revision=1f513601 version=11.10.1
WARNING: junit.xml: no matching files
ERROR: No files to upload
ERROR: Job failed: exit status 1
failed
validate-x86_64-windows-hadrian Full Build
Runtime platform                                    arch=amd64 os=windows pid=4048 revision=1f513601 version=11.10.1
WARNING: ghc.tar.xz: no matching files
WARNING: junit.xml: no matching files
ERROR: No files to upload
Uploading artifacts...
Runtime platform
arch=amd64 os=windows pid=4024 revision=1f513601 version=11.10.1
WARNING: junit.xml: no matching files
ERROR: No files to upload
ERROR: Job failed: exit status 1
failed
nightly-x86_64-linux-deb9-llvm Full Build
make[1]: *** [test] Error 1
make: *** [test] Error 2
Makefile:224: recipe for target 'test' failed
Running after script...
$ cp -Rf $HOME/.cabal cabal-cache
Uploading artifacts...
junit.xml: found 1 matching files
Uploading artifacts to coordinator... ok
id=154239 responseStatus=201 Created token=vuh2c8xW
ERROR: Job failed: exit code 1
failed
nightly-aarch64-linux-deb9 Full Build
build succeeded, 15 warnings.
make: *** [all] Error 2
Makefile:123: recipe for target 'all' failed
Running after script...
$ cp -Rf $HOME/.cabal cabal-cache
Uploading artifacts...
WARNING: junit.xml: no matching files
ERROR: No files to upload
ERROR: Job failed: exit code 1
failed
nightly-i386-linux-deb9 Full Build
$ cp -Rf $HOME/.cabal cabal-cache
Uploading artifacts...
ghc-*.tar.xz: found 1 matching files
junit.xml: found 1 matching files

Uploading artifacts to coordinator... ok
id=154237 responseStatus=201 Created token=vWnVGvXu
Uploading artifacts...
junit.xml: found 1 matching files

Uploading artifacts to coordinator... ok
id=154237 responseStatus=201 Created token=vWnVGvXu
ERROR: Job failed: exit code 1
failed
nightly-x86_64-linux-deb9 Full Build
make[1]: Leaving directory '/builds/ghc/ghc/testsuite/tests'
Makefile:228: recipe for target 'slowtest' failed
make: *** [slowtest] Error 2
Running after script...
$ cp -Rf $HOME/.cabal cabal-cache
Uploading artifacts...
junit.xml: found 1 matching files
Uploading artifacts to coordinator... ok
id=154238 responseStatus=201 Created token=2d212Q4k
ERROR: Job failed: exit code 1