gitlab-ci: source-tarball job should have no dependencies

26 jobs for master in 912 minutes (queued for 1 second)
Status Job ID Name Coverage
  Lint
passed #70761
lint
lint-submods

00:01:52

 
  Build
passed #70763
x86_64-linux
hadrian-ghc-in-ghci

00:16:35

failed #70762
x86_64-linux allowed to fail
validate-x86_64-linux-deb8-hadrian

02:56:47

passed #70764
x86_64-linux
validate-x86_64-linux-deb9-debug

01:11:28

 
  Full Build
failed #70767
aarch64-linux allowed to fail
nightly-aarch64-linux-deb9

01:05:42

failed #70769
x86_64-linux
nightly-i386-linux-deb9

01:47:18

failed #70851
x86_64-windows allowed to fail
nightly-i386-windows

09:33:01

failed #70777
x86_64-windows
nightly-i386-windows-hadrian

00:00:01

failed #70771
x86_64-linux
nightly-x86_64-linux-deb9

01:40:24

failed #70774
x86_64-linux
nightly-x86_64-linux-deb9-integer-simple

01:45:09

failed #70766
aarch64-linux allowed to fail
validate-aarch64-linux-deb9

01:05:42

passed #70768
x86_64-linux
validate-i386-linux-deb9

01:07:11

passed #70765
x86_64-darwin
validate-x86_64-darwin

00:57:16

passed #70770
x86_64-linux
validate-x86_64-linux-deb9

01:12:52

passed #70773
x86_64-linux
validate-x86_64-linux-deb9-integer-simple

00:53:12

passed #70772
x86_64-linux
validate-x86_64-linux-deb9-llvm

02:31:57

passed #70775
x86_64-linux
validate-x86_64-linux-deb9-unreg

02:40:16

passed #70776
x86_64-linux
validate-x86_64-linux-fedora27

01:13:46

failed #70778
x86_64-windows allowed to fail
validate-x86_64-windows

02:22:27

canceled #70779
x86_64-windows allowed to fail
nightly-i386-windows

06:54:42

 
  Cleanup
passed #70781
x86_64-darwin
cleanup-darwin

00:00:05

passed #70780
x86_64-windows
cleanup-windows

00:01:09

 
  Packaging
skipped #70782
x86_64-linux allowed to fail
doc-tarball
 
  Hackage
skipped #70783
x86_64-linux allowed to fail manual
hackage
skipped #70784
x86_64-linux
nightly-hackage
 
  Deploy
skipped #70785
x86_64-linux allowed to fail
pages
 
Name Stage Failure
failed
nightly-i386-windows Full Build
junit.xml: found 1 matching files                  
WARNING: Failed to load system CertPool: crypto/x509: system root pool is not available on Windows
Uploading artifacts to coordinator... ok
id=70851 responseStatus=201 Created token=2vDg2zgw
Uploading artifacts...
Runtime platform
arch=amd64 os=windows pid=5948 revision=7f00c780 version=11.5.1
junit.xml: found 1 matching files

WARNING: Failed to load system CertPool: crypto/x509: system root pool is not available on Windows
Uploading artifacts to coordinator... ok
id=70851 responseStatus=201 Created token=2vDg2zgw
ERROR: Job failed: exit status 2
failed
validate-x86_64-windows Full Build
junit.xml: found 1 matching files                  
WARNING: Failed to load system CertPool: crypto/x509: system root pool is not available on Windows
Uploading artifacts to coordinator... ok
id=70778 responseStatus=201 Created token=ZmE1Te-r
Uploading artifacts...
Runtime platform
arch=amd64 os=windows pid=3936 revision=7f00c780 version=11.5.1
junit.xml: found 1 matching files

WARNING: Failed to load system CertPool: crypto/x509: system root pool is not available on Windows
Uploading artifacts to coordinator... ok
id=70778 responseStatus=201 Created token=ZmE1Te-r
ERROR: Job failed: exit status 2
failed
nightly-i386-linux-deb9 Full Build
$ cp -Rf $HOME/.cabal cabal-cache
Uploading artifacts...
ghc-*.tar.xz: found 1 matching files
junit.xml: found 1 matching files
Uploading artifacts to coordinator... ok id=70769 responseStatus=201 Created token=DkrtFKHx
Uploading artifacts...
junit.xml: found 1 matching files
Uploading artifacts to coordinator... ok id=70769 responseStatus=201 Created token=DkrtFKHx
ERROR: Job failed: exit code 1
failed
nightly-x86_64-linux-deb9-integer-simple Full Build
make[1]: *** [slow] Error 2
make: *** [slowtest] Error 2
Makefile:228: recipe for target 'slowtest' failed
Running after script...
$ cp -Rf $HOME/.cabal cabal-cache
Uploading artifacts...
junit.xml: found 1 matching files
Uploading artifacts to coordinator... ok id=70774 responseStatus=201 Created token=9Xad9GqL
ERROR: Job failed: exit code 1
failed
nightly-x86_64-linux-deb9 Full Build
make[1]: Leaving directory '/builds/ghc/ghc/testsuite/tests'
make: *** [slowtest] Error 2
Makefile:228: recipe for target 'slowtest' failed
Running after script...
$ cp -Rf $HOME/.cabal cabal-cache
Uploading artifacts...
junit.xml: found 1 matching files
Uploading artifacts to coordinator... ok id=70771 responseStatus=201 Created token=sSvRMAPE
ERROR: Job failed: exit code 1
failed
nightly-aarch64-linux-deb9 Full Build
"touch" libffi/stamp.ffi.static-shared.configure
Makefile:123: recipe for target 'all' failed
make: *** [all] Error 2
Running after script...
$ cp -Rf $HOME/.cabal cabal-cache
Uploading artifacts...
WARNING: junit.xml: no matching files
ERROR: No files to upload
ERROR: Job failed: exit code 1
failed
validate-aarch64-linux-deb9 Full Build
$ cp -Rf $HOME/.cabal cabal-cache
Uploading artifacts...
WARNING: ghc-*.tar.xz: no matching files
WARNING: junit.xml: no matching files
ERROR: No files to upload
Uploading artifacts...
WARNING: junit.xml: no matching files
ERROR: No files to upload
ERROR: Job failed: exit code 1
failed
nightly-i386-windows-hadrian Full Build
Cloning repository...
fatal: destination path 'C:/GitLabRunner/builds/e963ee11/0/ghc/ghc' already exists and is not an empty directory.
Checking out 465f8f48 as master...
fatal: not a git repository (or any of the parent directories): .git
Uploading artifacts...
Runtime platform arch=amd64 os=windows pid=6024 revision=7f00c780 version=11.5.1
WARNING: ghc.tar.xz: no matching files
ERROR: No files to upload
ERROR: Job failed: exit status 128
failed
validate-x86_64-linux-deb8-hadrian Build

fatal: unable to auto-detect email address (got 'ghc@runner-4vD1x1BB-project-1-concurrent-0.(none)')
)


Uploading artifacts...
WARNING: ghc.tar.xz: no matching files
ERROR: No files to upload
ERROR: Job failed: exit code 1