gitlab-ci: Reintroduce DWARF-enabled bindists

It seems that this was inadvertently dropped in
1285d6b9.
18 jobs for ghc-8.8 in 320 minutes and 45 seconds (queued for 5 seconds)
Status Job ID Name Coverage
  Lint
failed #72624
lint allowed to fail
lint-changelogs

00:00:12

passed #72623
lint
lint-submods

00:00:15

 
  Build
failed #72627
x86_64-linux allowed to fail
release-x86_64-linux-deb9-dwarf

00:00:28

passed #72625
x86_64-linux
validate-x86_64-linux-deb8-hadrian

02:52:37

passed #72626
x86_64-linux
validate-x86_64-linux-deb9-debug

00:37:24

 
  Full Build
failed #72629
aarch64-linux allowed to fail
validate-aarch64-linux-deb9

00:57:42

passed #72630
x86_64-linux
validate-i386-linux-deb9

00:50:53

passed #72628
x86_64-darwin
validate-x86_64-darwin

00:56:34

passed #72631
x86_64-linux
validate-x86_64-linux-deb9

01:01:39

failed #72633
x86_64-linux allowed to fail
validate-x86_64-linux-deb9-integer-simple

00:22:39

failed #72632
x86_64-linux allowed to fail
validate-x86_64-linux-deb9-llvm

01:55:36

passed #72634
x86_64-linux
validate-x86_64-linux-deb9-unreg

01:59:02

passed #72635
x86_64-linux
validate-x86_64-linux-fedora27

01:07:09

failed #72637
x86_64-windows allowed to fail
validate-x86_64-windows

02:27:12

failed #72636
x86_64-windows allowed to fail
validate-x86_64-windows-hadrian

00:00:03

 
  Cleanup
passed #72639
x86_64-darwin
cleanup-darwin

00:00:06

passed #72638
x86_64-windows
cleanup-windows

00:00:33

 
  Hackage
manual #72640
x86_64-linux allowed to fail manual
hackage
 
Name Stage Failure
failed
lint-changelogs Lint
Submodule path 'utils/haddock': checked out '1126fe196fd0d5a2ad73e965982d6c75a2df0279'
$ git checkout .gitmodules
$ git fetch https://gitlab.haskell.org/ghc/ghc-performance-notes.git refs/notes/perf:refs/notes/perf || true
$ grep TBA libraries/*/changelog.md && ( # collapsed multi-line command
libraries/array/changelog.md:## 0.5.4.0 *TBA*
libraries/base/changelog.md:## 4.13.0.0 *TBA*
libraries/base/changelog.md: * Bundled with GHC *TBA*
Error: Found "TBA"s in changelogs.
ERROR: Job failed: exit code 1
failed
release-x86_64-linux-deb9-dwarf Build
$ cp -Rf $HOME/.cabal cabal-cache
Uploading artifacts...
WARNING: ghc-*.tar.xz: no matching files
WARNING: junit.xml: no matching files
ERROR: No files to upload
Uploading artifacts...
WARNING: junit.xml: no matching files
ERROR: No files to upload
ERROR: Job failed: exit code 1
failed
validate-x86_64-linux-deb9-integer-simple Full Build
libraries/text/ghc.mk:4: recipe for target 'libraries/text/dist-install/build/Data/Text/Lazy/Builder/Int.o' failed
make: *** [all] Error 2
Makefile:123: recipe for target 'all' failed
Running after script...
$ cp -Rf $HOME/.cabal cabal-cache
Uploading artifacts...
WARNING: junit.xml: no matching files
ERROR: No files to upload
ERROR: Job failed: exit code 1
failed
validate-x86_64-linux-deb9-llvm Full Build
make[1]: *** [test] Error 1
Makefile:224: recipe for target 'test' failed
make: *** [test] Error 2
Running after script...
$ cp -Rf $HOME/.cabal cabal-cache
Uploading artifacts...
junit.xml: found 1 matching files
Uploading artifacts to coordinator... ok
id=72632 responseStatus=201 Created token=JR5fqSgx
ERROR: Job failed: exit code 1
failed
validate-x86_64-windows-hadrian Full Build
an editor opened by 'git commit'. Please make sure all processes
are terminated then try again. If it still fails, a git process
may have crashed in this repository earlier:
remove the file manually to continue.
Uploading artifacts...
Runtime platform arch=amd64 os=windows pid=3200 revision=7f00c780 version=11.5.1
WARNING: ghc.tar.xz: no matching files
ERROR: No files to upload
ERROR: Job failed: exit status 128
failed
validate-aarch64-linux-deb9 Full Build
$ cp -Rf $HOME/.cabal cabal-cache
Uploading artifacts...
WARNING: ghc-*.tar.xz: no matching files
WARNING: junit.xml: no matching files
ERROR: No files to upload
Uploading artifacts...
WARNING: junit.xml: no matching files
ERROR: No files to upload
ERROR: Job failed: exit code 1
failed
validate-x86_64-windows Full Build
junit.xml: found 1 matching files                  
WARNING: Failed to load system CertPool: crypto/x509: system root pool is not available on Windows
Uploading artifacts to coordinator... ok
id=72637 responseStatus=201 Created token=FxMZF9P3
Uploading artifacts...
Runtime platform
arch=amd64 os=windows pid=7064 revision=7f00c780 version=11.5.1
junit.xml: found 1 matching files

WARNING: Failed to load system CertPool: crypto/x509: system root pool is not available on Windows
Uploading artifacts to coordinator... ok
id=72637 responseStatus=201 Created token=FxMZF9P3
ERROR: Job failed: exit status 2