Remove Unused flag -ddump-shape [skip ci]

31 jobs for master in 749 minutes and 35 seconds (queued for 5 seconds)
Status Job ID Name Coverage
  Lint
passed #147579
lint
lint-linters

00:00:15

passed #147582
lint
lint-submods-branch

00:00:18

passed #147580
lint
lint-testsuite

00:00:17

passed #147581
lint
typecheck-testsuite

00:00:16

 
  Build
passed #147584
x86_64-linux
hadrian-ghc-in-ghci

00:14:25

passed #147586
x86_64-linux
release-x86_64-linux-deb9-dwarf

01:51:41

passed #147585
x86_64-linux
validate-x86_64-linux-deb9-debug

02:22:21

passed #147583
x86_64-linux
validate-x86_64-linux-deb9-hadrian

02:24:59

 
  Full Build
failed #147589
aarch64-linux allowed to fail
nightly-aarch64-linux-deb9

01:10:53

failed #147591
x86_64-linux
nightly-i386-linux-deb9

02:50:04

failed #147603
x86_64-windows allowed to fail
nightly-i386-windows

10:03:51

failed #147600
x86_64-windows allowed to fail
nightly-i386-windows-hadrian

00:02:15

failed #147597
x86_64-linux allowed to fail
nightly-x86_64-linux-alpine

01:56:12

passed #147592
x86_64-linux
nightly-x86_64-linux-deb9

01:37:49

passed #147595
x86_64-linux
nightly-x86_64-linux-deb9-integer-simple

03:22:25

failed #147593
x86_64-linux
nightly-x86_64-linux-deb9-llvm

03:19:37

failed #147602
x86_64-windows allowed to fail
nightly-x86_64-windows

00:03:36

failed #147588
aarch64-linux allowed to fail
validate-aarch64-linux-deb9

01:10:16

passed #147590
x86_64-linux
validate-i386-linux-deb9

01:46:55

failed #147587
x86_64-darwin
validate-x86_64-darwin

00:03:02

passed #147594
x86_64-linux
validate-x86_64-linux-deb9-integer-simple

01:32:37

passed #147596
x86_64-linux
validate-x86_64-linux-deb9-unreg

02:56:15

passed #147598
x86_64-linux
validate-x86_64-linux-fedora27

01:50:13

failed #147601
x86_64-windows allowed to fail
validate-x86_64-windows

00:03:38

failed #147599
x86_64-windows allowed to fail
validate-x86_64-windows-hadrian

00:02:42

 
  Cleanup
passed #147604
x86_64-darwin
cleanup-darwin

00:00:05

 
  Packaging
skipped #147605
x86_64-linux allowed to fail
doc-tarball
 
  Testing
skipped #147606
x86_64-linux allowed to fail manual
hackage
skipped #147607
x86_64-linux
nightly-hackage
skipped #147608
x86_64-linux
perf-nofib
 
  Deploy
skipped #147609
x86_64-linux allowed to fail
pages
 
Name Stage Failure
failed
validate-x86_64-darwin Full Build
Runtime platform                                    arch=amd64 os=darwin pid=40978 revision=3001a600 version=11.10.0
WARNING: ghc-*.tar.xz: no matching files
WARNING: junit.xml: no matching files
ERROR: No files to upload
Uploading artifacts...
Runtime platform
arch=amd64 os=darwin pid=40980 revision=3001a600 version=11.10.0
WARNING: junit.xml: no matching files
ERROR: No files to upload
ERROR: Job failed: exit status 1
failed
validate-aarch64-linux-deb9 Full Build
cp: error writing 'cabal-cache/world': No space left on device
Uploading artifacts...
WARNING: ghc-*.tar.xz: no matching files
WARNING: junit.xml: no matching files
ERROR: No files to upload
Uploading artifacts...
WARNING: junit.xml: no matching files
ERROR: No files to upload
ERROR: Job failed: exit code 1
failed
nightly-aarch64-linux-deb9 Full Build
cp: error writing 'cabal-cache/packages/hackage.haskell.org/root.json': No space left on device
cp: error writing 'cabal-cache/packages/hackage.haskell.org/snapshot.json': No space left on device
cp: error writing 'cabal-cache/packages/hackage.haskell.org/timestamp.json': No space left on device
cp: cannot create directory 'cabal-cache/share': No space left on device
cp: error writing 'cabal-cache/world': No space left on device
Uploading artifacts...
WARNING: junit.xml: no matching files
ERROR: No files to upload
ERROR: Job failed: exit code 1
failed
nightly-x86_64-linux-deb9-llvm Full Build
make[1]: *** [test] Error 1
make: *** [test] Error 2
Makefile:224: recipe for target 'test' failed
Running after script...
$ cp -Rf $HOME/.cabal cabal-cache
Uploading artifacts...
junit.xml: found 1 matching files
Uploading artifacts to coordinator... ok
id=147593 responseStatus=201 Created token=Mufb6_xx
ERROR: Job failed: exit code 1
failed
nightly-x86_64-linux-alpine Full Build
$ cp -Rf $HOME/.cabal cabal-cache
Uploading artifacts...
ghc-*.tar.xz: found 1 matching files
junit.xml: found 1 matching files

Uploading artifacts to coordinator... ok
id=147597 responseStatus=201 Created token=rP9xXPU2
Uploading artifacts...
junit.xml: found 1 matching files

Uploading artifacts to coordinator... ok
id=147597 responseStatus=201 Created token=rP9xXPU2
ERROR: Job failed: exit code 1
failed
nightly-i386-windows-hadrian Full Build
Runtime platform                                    arch=amd64 os=windows pid=5580 revision=1f513601 version=11.10.1
WARNING: ghc.tar.xz: no matching files
WARNING: junit.xml: no matching files
ERROR: No files to upload
Uploading artifacts...
Runtime platform
arch=amd64 os=windows pid=7852 revision=1f513601 version=11.10.1
WARNING: junit.xml: no matching files
ERROR: No files to upload
ERROR: Job failed: exit status 9
failed
nightly-x86_64-windows Full Build
Runtime platform                                    arch=amd64 os=windows pid=280 revision=1f513601 version=11.10.1
WARNING: ghc-*.tar.xz: no matching files
WARNING: junit.xml: no matching files
ERROR: No files to upload
Uploading artifacts...
Runtime platform
arch=amd64 os=windows pid=3336 revision=1f513601 version=11.10.1
WARNING: junit.xml: no matching files
ERROR: No files to upload
ERROR: Job failed: exit status 9
failed
validate-x86_64-windows Full Build
Runtime platform                                    arch=amd64 os=windows pid=7048 revision=1f513601 version=11.10.1
WARNING: ghc-*.tar.xz: no matching files
WARNING: junit.xml: no matching files
ERROR: No files to upload
Uploading artifacts...
Runtime platform
arch=amd64 os=windows pid=932 revision=1f513601 version=11.10.1
WARNING: junit.xml: no matching files
ERROR: No files to upload
ERROR: Job failed: exit status 9
failed
validate-x86_64-windows-hadrian Full Build
Runtime platform                                    arch=amd64 os=windows pid=6760 revision=1f513601 version=11.10.1
WARNING: ghc.tar.xz: no matching files
WARNING: junit.xml: no matching files
ERROR: No files to upload
Uploading artifacts...
Runtime platform
arch=amd64 os=windows pid=4724 revision=1f513601 version=11.10.1
WARNING: junit.xml: no matching files
ERROR: No files to upload
ERROR: Job failed: exit status 9
failed
nightly-i386-linux-deb9 Full Build
$ cp -Rf $HOME/.cabal cabal-cache
Uploading artifacts...
ghc-*.tar.xz: found 1 matching files
junit.xml: found 1 matching files

Uploading artifacts to coordinator... ok
id=147591 responseStatus=201 Created token=thPX6e7d
Uploading artifacts...
junit.xml: found 1 matching files

Uploading artifacts to coordinator... ok
id=147591 responseStatus=201 Created token=thPX6e7d
ERROR: Job failed: exit code 1
failed
nightly-i386-windows Full Build
junit.xml: found 1 matching files                  
WARNING: Failed to load system CertPool:crypto/x509: system root pool is not available on Windows
Uploading artifacts to coordinator... ok
id=147603 responseStatus=201 Created token=ZU98bGQC
Uploading artifacts...
Runtime platform
arch=amd64 os=windows pid=4256 revision=1f513601 version=11.10.1
junit.xml: found 1 matching files

WARNING: Failed to load system CertPool:crypto/x509: system root pool is not available on Windows
Uploading artifacts to coordinator... ok
id=147603 responseStatus=201 Created token=ZU98bGQC
ERROR: Job failed: exit status 2