Add missing newline

30 jobs for pr-missing-newline in 17 minutes and 38 seconds (queued for 4 seconds)
latest
Name Stage Failure
failed
test:mac:8.6.2 Test
/Library/Developer/CommandLineTools/usr/bin/ranlib: file: /Users/builder/builds/_myksA1Q/0/glguy/ghcup/.ghcup/ghc/8.6.2/lib/ghc-8.6.2/rts/libHSrts_thr_p.a(Select.thr_p_o) has no symbols
"utils/ghc-cabal/dist-install/build/tmp/ghc-cabal-bindist" copy libraries/ghc-prim dist-install "strip" '' '/Users/builder/builds/_myksA1Q/0/glguy/ghcup/.ghcup/ghc/8.6.2' '/Users/builder/builds/_myksA1Q/0/glguy/ghcup/.ghcup/ghc/8.6.2/lib/ghc-8.6.2' '/Users/builder/builds/_myksA1Q/0/glguy/ghcup/.ghcup/ghc/8.6.2/share/doc/ghc-8.6.2/html/libraries' 'v p dyn'
dyld: Library not loaded: /usr/local/opt/gmp/lib/libgmp.10.dylib
Referenced from: /private/var/folders/yp/dkpl869d48xg22mwq3n8bd5r0000gq/T/ghcup.JCvsRQeV/ghc-8.6.2/libraries/base/dist-install/build/libHSbase-4.12.0.0-ghc8.6.2.dylib
Reason: image not found
make[1]: *** [install_packages] Abort trap: 6
make: *** [install] Error 2
Failed to install, consider updating this script via: ghcup upgrade
ERROR: Job failed: exit status 1
failed
test:mac:8.6.1 Test
/Library/Developer/CommandLineTools/usr/bin/ranlib: file: /Users/builder/Desktop/builds/V164sjj5/0/glguy/ghcup/.ghcup/ghc/8.6.1/lib/ghc-8.6.1/rts/libHSrts_thr_p.a(Select.thr_p_o) has no symbols
"utils/ghc-cabal/dist-install/build/tmp/ghc-cabal-bindist" copy libraries/ghc-prim dist-install "strip" '' '/Users/builder/Desktop/builds/V164sjj5/0/glguy/ghcup/.ghcup/ghc/8.6.1' '/Users/builder/Desktop/builds/V164sjj5/0/glguy/ghcup/.ghcup/ghc/8.6.1/lib/ghc-8.6.1' '/Users/builder/Desktop/builds/V164sjj5/0/glguy/ghcup/.ghcup/ghc/8.6.1/share/doc/ghc-8.6.1/html/libraries' 'v p dyn'
dyld: Library not loaded: /usr/local/opt/gmp/lib/libgmp.10.dylib
Referenced from: /private/var/folders/lz/c2p1b7_9415d219xpnw9blbr0000gp/T/ghcup.OW5nq3Am/ghc-8.6.1/libraries/base/dist-install/build/libHSbase-4.12.0.0-ghc8.6.1.dylib
Reason: image not found
make[1]: *** [install_packages] Abort trap: 6
make: *** [install] Error 2
Failed to install, consider updating this script via: ghcup upgrade
ERROR: Job failed: exit status 1