Use stage1 haddock

19 jobs for hadrian-stage3 in 260 minutes and 33 seconds (queued for 119 minutes and 51 seconds)
Status Job ID Name Coverage
  Lint
passed #4540
lint
ghc-linters

00:01:23

failed #4429
lint
ghc-linters

 
  Build
passed #4946
x86_64-linux allowed to fail
validate-x86_64-linux-deb8-hadrian

01:07:53

passed #4947
x86_64-linux
validate-x86_64-linux-deb9

00:54:56

failed #4430
x86_64-linux allowed to fail
validate-x86_64-linux-deb8-hadrian

01:00:01

failed #4431
x86_64-linux
validate-x86_64-linux-deb9

01:00:00

canceled #4774
x86_64-linux
validate-x86_64-linux-deb9

 
  Full Build
failed #4442
circleci
circleci-validate-x86_64-darwin

00:02:00

failed #4433
aarch64-linux allowed to fail
validate-aarch64-linux-deb9

02:45:29

passed #4434
x86_64-linux allowed to fail
validate-i386-linux-deb9

00:52:06

failed #4432
x86_64-darwin allowed to fail
validate-x86_64-darwin

01:19:47

passed #4436
x86_64-linux
validate-x86_64-linux-deb8

00:42:51

failed #4438
x86_64-linux allowed to fail
validate-x86_64-linux-deb9-integer-simple

01:12:28

failed #4435
x86_64-linux allowed to fail
validate-x86_64-linux-deb9-llvm

01:35:12

failed #4439
x86_64-linux
validate-x86_64-linux-deb9-unreg

01:13:07

passed #4437
x86_64-linux
validate-x86_64-linux-fedora27

00:55:47

failed #4441
x86_64-windows
validate-x86_64-windows

02:53:45

failed #4440
x86_64-windows allowed to fail
validate-x86_64-windows-hadrian

02:05:06

 
  External
failed continuous-integration/appveyor/merge-request

 
Name Stage Failure
failed
circleci-validate-x86_64-darwin Full Build

Uploading artifacts...
ghc.tar.xz: found 1 matching files
junit.xml: found 1 matching files

Uploading artifacts to coordinator... ok
id=4442 responseStatus=201 Created token=ssBSefJy
Uploading artifacts...
junit.xml: found 1 matching files

Uploading artifacts to coordinator... ok
id=4442 responseStatus=201 Created token=ssBSefJy
ERROR: Job failed: exit code 1
failed
validate-x86_64-windows-hadrian Full Build
  at src/Main.hs:58:30-42:
* Depends on: binary-dist
at src/Rules/BinaryDist.hs:97:9-21:
* Depends on: _build/stage1/lib/package.conf.d/rts-1.0.conf
* Raised the exception:
ExitFailure 1


ERROR: Job failed: exit status 1
failed
validate-x86_64-linux-deb9-integer-simple Full Build
make[1]: Leaving directory '/builds/mpickering/ghc/testsuite/tests'
Makefile:224: recipe for target 'test' failed
make: *** [test] Error 2
Running after script...
$ cp -Rf $HOME/.cabal cabal-cache
Uploading artifacts...
junit.xml: found 1 matching files
Uploading artifacts to coordinator... ok
id=4438 responseStatus=201 Created token=qjkT8Mta
ERROR: Job failed: exit code 1
failed
validate-x86_64-linux-deb9-unreg Full Build
make[1]: Leaving directory '/builds/mpickering/ghc/testsuite/tests'
make: *** [test] Error 2
Makefile:224: recipe for target 'test' failed
Running after script...
$ cp -Rf $HOME/.cabal cabal-cache
Uploading artifacts...
junit.xml: found 1 matching files
Uploading artifacts to coordinator... ok
id=4439 responseStatus=201 Created token=YoHzA9-R
ERROR: Job failed: exit code 1
failed
validate-x86_64-linux-deb9-llvm Full Build
make[1]: *** [test] Error 1
make: *** [test] Error 2
Makefile:224: recipe for target 'test' failed
Running after script...
$ cp -Rf $HOME/.cabal cabal-cache
Uploading artifacts...
junit.xml: found 1 matching files
Uploading artifacts to coordinator... ok
id=4435 responseStatus=201 Created token=CyTpzN3B
ERROR: Job failed: exit code 1
failed
validate-x86_64-windows Full Build
   plugins/plugin-recomp-impure.run        plugin-recomp-impure [bad exit code] (normal)
plugins/plugin-recomp-flags.run plugin-recomp-flags [bad exit code] (normal)


Working Tree is Dirty performance metrics will not be saved. Commit changes or use --metrics-file to save metrics to a file.
make[1]: *** [../mk/test.mk:345: test] Error 1
make[1]: Leaving directory '/c/GitLabRunner/builds/6c4de101/1/mpickering/ghc/testsuite/tests'
make: *** [Makefile:224: test] Error 2
ERROR: Job failed: exit status 2
failed
validate-x86_64-darwin Full Build
Runtime platform                                    arch=amd64 os=darwin pid=96528 revision=7f00c780 version=11.5.1
ghc.tar.xz: found 1 matching files

junit.xml: found 1 matching files

Uploading artifacts to coordinator... ok
id=4432 responseStatus=201 Created token=F3rhptxh
Uploading artifacts...
Runtime platform
arch=amd64 os=darwin pid=96542 revision=7f00c780 version=11.5.1
junit.xml: found 1 matching files

Uploading artifacts to coordinator... ok
id=4432 responseStatus=201 Created token=F3rhptxh
ERROR: Job failed: exit status 1
failed
validate-aarch64-linux-deb9 Full Build
$ cp -Rf $HOME/.cabal cabal-cache
Uploading artifacts...
ghc.tar.xz: found 1 matching files
junit.xml: found 1 matching files

Uploading artifacts to coordinator... ok
id=4433 responseStatus=201 Created token=YtQKKwsT
Uploading artifacts...
junit.xml: found 1 matching files

Uploading artifacts to coordinator... ok
id=4433 responseStatus=201 Created token=YtQKKwsT
ERROR: Job failed: exit code 1